Target
Sodium-dependent dopamine transporter
Ligand
BDBM50021897
Substrate
Meas. Tech.
ChEBML_193333
Ki
2.6±n/a nM
Citation
 Maryanoff, BEMcComsey, DFGardocki, JFShank, RPCostanzo, MJNortey, SOSchneider, CRSetler, PE Pyrroloisoquinoline antidepressants. 2. In-depth exploration of structure-activity relationships. J Med Chem 30:1433-54 (1987)  
Target
Name:
Sodium-dependent dopamine transporter
Synonyms:
DA transporter SC6A3_RAT Sodium-dependent dopamine transporter | Sodium-dependent dopamine transporter (DAT)
Type:
Multi-pass membrane protein
Mol. Mass.:
68749.45
Organism:
Rattus norvegicus (rat)
Description:
P23977
Residue:
619
  
Inhibitor
Name:
BDBM50021897
Synonyms:
6-(4-Ethynyl-phenyl)-1,2,3,5,6,10b-hexahydro-pyrrolo[2,1-a]isoquinoline;HCl | CHEMBL286312
Type:
Small organic molecule
Emp. Form.:
C20H19N
Mol. Mass.:
273.3716
SMILES:
C#Cc1ccc(cc1)[C@@H]1CN2CCC[C@@H]2c2ccccc12
: