Target
Transporter
Ligand
BDBM50367587
Substrate
Meas. Tech.
ChEBML_193336
Ki
0.850000±n/a nM
Citation
 Maryanoff, BEMcComsey, DFGardocki, JFShank, RPCostanzo, MJNortey, SOSchneider, CRSetler, PE Pyrroloisoquinoline antidepressants. 2. In-depth exploration of structure-activity relationships. J Med Chem 30:1433-54 (1987)  
Target
Name:
Transporter
Synonyms:
Monoamine transporters; Norepininephrine & dopamine | Norepinephrine Monoamine transporters
Type:
PROTEIN
Mol. Mass.:
66787.87
Organism:
Rattus norvegicus
Description:
ChEMBL_1463061
Residue:
597
  
Inhibitor
Name:
BDBM50367587
Synonyms:
CHEMBL1743793
Type:
Small organic molecule
Emp. Form.:
C18H19NO
Mol. Mass.:
265.3496
SMILES:
Oc1cccc(c1)[C@@H]1CN2CCC[C@@H]2c2ccccc12
: