Target
Transporter
Ligand
BDBM50367563
Substrate
Meas. Tech.
ChEBML_193336
Ki
1.3±n/a nM
Citation
 Maryanoff, BEMcComsey, DFGardocki, JFShank, RPCostanzo, MJNortey, SOSchneider, CRSetler, PE Pyrroloisoquinoline antidepressants. 2. In-depth exploration of structure-activity relationships. J Med Chem 30:1433-54 (1987)  
Target
Name:
Transporter
Synonyms:
Monoamine transporters; Norepininephrine & dopamine | Norepinephrine Monoamine transporters
Type:
PROTEIN
Mol. Mass.:
66787.87
Organism:
Rattus norvegicus
Description:
ChEMBL_1463061
Residue:
597
  
Inhibitor
Name:
BDBM50367563
Synonyms:
CHEMBL1743824
Type:
Small organic molecule
Emp. Form.:
C19H21N
Mol. Mass.:
263.3767
SMILES:
C[C@@]1(CN2CCC[C@H]2c2ccccc12)c1ccccc1
: