Target
Transporter
Ligand
BDBM50021870
Substrate
Meas. Tech.
ChEBML_193336
Ki
3.1±n/a nM
Citation
 Maryanoff, BEMcComsey, DFGardocki, JFShank, RPCostanzo, MJNortey, SOSchneider, CRSetler, PE Pyrroloisoquinoline antidepressants. 2. In-depth exploration of structure-activity relationships. J Med Chem 30:1433-54 (1987)  
Target
Name:
Transporter
Synonyms:
Monoamine transporters; Norepininephrine & dopamine | Norepinephrine Monoamine transporters
Type:
PROTEIN
Mol. Mass.:
66787.87
Organism:
Rattus norvegicus
Description:
ChEMBL_1463061
Residue:
597
  
Inhibitor
Name:
BDBM50021870
Synonyms:
6-Phenyl-9-trifluoromethyl-1,2,3,5,6,10b-hexahydro-pyrrolo[2,1-a]isoquinoline;HCl | CHEMBL35166
Type:
Small organic molecule
Emp. Form.:
C19H18F3N
Mol. Mass.:
317.3481
SMILES:
FC(F)(F)c1ccc2[C@@H](CN3CCC[C@@H]3c2c1)c1ccccc1
: