Target
Sodium-dependent dopamine transporter
Ligand
BDBM50367588
Substrate
Meas. Tech.
ChEBML_193333
Ki
2.9±n/a nM
Citation
 Maryanoff, BEMcComsey, DFGardocki, JFShank, RPCostanzo, MJNortey, SOSchneider, CRSetler, PE Pyrroloisoquinoline antidepressants. 2. In-depth exploration of structure-activity relationships. J Med Chem 30:1433-54 (1987)  
Target
Name:
Sodium-dependent dopamine transporter
Synonyms:
DA transporter SC6A3_RAT Sodium-dependent dopamine transporter | Sodium-dependent dopamine transporter (DAT)
Type:
Multi-pass membrane protein
Mol. Mass.:
68749.45
Organism:
Rattus norvegicus (rat)
Description:
P23977
Residue:
619
  
Inhibitor
Name:
BDBM50367588
Synonyms:
CHEMBL1743805
Type:
Small organic molecule
Emp. Form.:
C20H20N2
Mol. Mass.:
288.3862
SMILES:
C1C[C@@H]2N(C1)C[C@@H](c1c2[nH]c2ccccc12)c1ccccc1
: