Target
Transporter
Ligand
BDBM50021898
Substrate
Meas. Tech.
ChEBML_193336
Ki
1.4±n/a nM
Citation
 Maryanoff, BEMcComsey, DFGardocki, JFShank, RPCostanzo, MJNortey, SOSchneider, CRSetler, PE Pyrroloisoquinoline antidepressants. 2. In-depth exploration of structure-activity relationships. J Med Chem 30:1433-54 (1987)  
Target
Name:
Transporter
Synonyms:
Monoamine transporters; Norepininephrine & dopamine | Norepinephrine Monoamine transporters
Type:
PROTEIN
Mol. Mass.:
66787.87
Organism:
Rattus norvegicus
Description:
ChEMBL_1463061
Residue:
597
  
Inhibitor
Name:
BDBM50021898
Synonyms:
6-(4-Fluoro-phenyl)-1,2,3,5,6,10b-hexahydro-pyrrolo[2,1-a]isoquinoline;HBr | CHEMBL287859
Type:
Small organic molecule
Emp. Form.:
C18H18FN
Mol. Mass.:
267.3406
SMILES:
Fc1ccc(cc1)[C@@H]1CN2CCC[C@@H]2c2ccccc12
: