Target
Delta-type opioid receptor
Ligand
BDBM50019839
Substrate
Meas. Tech.
ChEBML_146880
IC50
850±n/a nM
Citation
 Marastoni, MSalvadori, SBalboni, GBorea, PAMarzola, GTomatis, R Synthesis and activity profiles of new dermorphin-(1-4) peptide analogues. J Med Chem 30:1538-42 (1987)  
Target
Name:
Delta-type opioid receptor
Synonyms:
D-OR-1 Delta opioid receptor OPIATE Delta OPRD1 OPRK1 | opioid receptor, delta 1
Type:
G Protein-Coupled Receptor (GPCR)
Mol. Mass.:
40382.98
Organism:
Homo sapiens (Human)
Description:
Competition binding assays were carried out using membrane preparations from transfected HN9.10 cells that constitutively expressed the delta opioid receptor.
Residue:
372
  
Inhibitor
Name:
BDBM50019839
Synonyms:
(2-{2-[2-Amino-3-(4-hydroxy-phenyl)-propionylamino]-4-methanesulfinyl-butyrylamino}-3-phenyl-propionylamino)-acetic acid methyl ester | CHEMBL2372387
Type:
Small organic molecule
Emp. Form.:
C26H34N4O7S
Mol. Mass.:
546.636
SMILES:
COC(=O)CNC(=O)[C@H](Cc1ccccc1)NC(=O)[C@H](CC[S+](C)[O-])NC(=O)[C@@H](N)Cc1ccc(O)cc1
: