Target
Adenosine receptor A2a/A2b
Ligand
BDBM50118810
Substrate
Meas. Tech.
ChEMBL_27763 (CHEMBL643368)
EC50
950±n/a nM
Citation
 Cristalli, GFranchetti, PGrifantini, MVittori, SKlotz, KNLohse, MJ Adenosine receptor agonists: synthesis and biological evaluation of 1-deaza analogues of adenosine derivatives. J Med Chem 31:1179-83 (1988)  
Target
Name:
Adenosine receptor A2a/A2b
Synonyms:
Adenosine A2 receptor
Type:
Mol. Mass.:
Description:
ASSAY_ID of ChEMBL is 329906
Components:
This complex has 2 components.
Component 1
Name:
Adenosine receptor A2b
Synonyms:
AA2BR_HUMAN ADORA2B Adenosine receptors A2b | Adenosine receptors; A2a & A2b
Type:
G Protein-Coupled Receptor (GPCR)
Mol. Mass.:
36341.22
Organism:
Homo sapiens (Human)
Description:
Residue:
332
  
Component 2
Name:
Adenosine receptor A2a
Synonyms:
A2A adenosine receptor (hA2A) ADENOSINE A2 ADORA2 Adenosine A2A receptor (A2AAR)
Type:
G Protein-Coupled Receptor (GPCR)
Mol. Mass.:
44716.46
Organism:
Homo sapiens (Human)
Description:
P29274
Residue:
412
  
Inhibitor
Name:
BDBM50118810
Synonyms:
(2R,3S,4R,5R)-2-(hydroxymethyl)-5-(6-((R)-1-phenylpropan-2-ylamino)-9H-purin-9-yl)-tetrahydrofuran-3,4-diol CHEMBL139000 R-N6-(phenylisopropyl)adenosine
Type:
Small organic molecule
Emp. Form.:
C19H23N5O4
Mol. Mass.:
385.417
SMILES:
C[C@H](Cc1ccccc1)Nc1ncnc2n(cnc12)[C@@H]1O[C@H](CO)[C@@H](O)[C@H]1O
: