Target
Carbonic anhydrase 2
Ligand
BDBM50367483
Substrate
Meas. Tech.
ChEMBL_45241 (CHEMBL658944)
Ki
16±n/a nM
Citation
 Baldwin, JJPonticello, GSAnderson, PSChristy, MEMurcko, MARandall, WCSchwam, HSugrue, MFSpringer, JPGautheron, P Thienothiopyran-2-sulfonamides: novel topically active carbonic anhydrase inhibitors for the treatment of glaucoma. J Med Chem 32:2510-3 (1989)  
Target
Name:
Carbonic anhydrase 2
Synonyms:
CA-II CAC Carbonate dehydratase II Carbonic anhydrase 2 (CA-II) Carbonic anhydrase C Carbonic anhydrase II (CA-II) Carbonic anhydrase II (hCA II) | Carbonic anhydrase isoenzyme II (hCA II)
Type:
Enzyme
Mol. Mass.:
29250.71
Organism:
Homo sapiens (Human)
Description:
P00918
Residue:
260
  
Inhibitor
Name:
BDBM50367483
Synonyms:
CHEMBL1788205
Type:
Small organic molecule
Emp. Form.:
C7H9NO5S3
Mol. Mass.:
283.345
SMILES:
NS(=O)(=O)c1cc2[C@H](O)CCS(=O)(=O)c2s1
: