Target
Renin
Ligand
BDBM912
Substrate
Meas. Tech.
ChEMBL_195952 (CHEMBL806847)
pH
6±n/a
IC50
3200±n/a nM
Comments
extracted
Citation
 Rosenberg, SHWoods, KWKleinert, HDStein, HNellans, HNHoffman, DJSpanton, SGPyter, RACohen, JEgan, DA Azido glycols: potent, low molecular weight renin inhibitors containing an unusual post scissile site residue. J Med Chem 32:1371-8 (1989)  
Target
Name:
Renin
Synonyms:
Angiotensinogenase RENI_HUMAN
Type:
Enzyme
Mol. Mass.:
45058.99
Organism:
Homo sapiens (Human)
Description:
Residue:
406
  
Inhibitor
Name:
BDBM912
Synonyms:
(3S,4S)-3-hydroxy-4-[(2S)-2-[(3S,4S)-3-hydroxy-6-methyl-4-[(2S)-3-methyl-2-[(2S)-3-methyl-2-(3-methylbutanamido)butanamido]butanamido]heptanamido]propanamido]-6-methylheptanoic acid Iva-Val-Val-Sta-Ala-Sta-OH PEPSTATIN US9115083, Pepstatin
Type:
Small organic molecule
Emp. Form.:
C34H63N5O9
Mol. Mass.:
685.8921
SMILES:
CC(C)C[C@H](NC(=O)[C@H](C)NC(=O)C[C@H](O)[C@H](CC(C)C)NC(=O)[C@@H](NC(=O)[C@@H](NC(=O)CC(C)C)C(C)C)C(C)C)[C@@H](O)CC(O)=O
: