Target
Renin
Ligand
BDBM50017773
Substrate
Meas. Tech.
ChEMBL_195952 (CHEMBL806847)
pH
6±n/a
IC50
4±n/a nM
Comments
extracted
Citation
 Rosenberg, SHWoods, KWKleinert, HDStein, HNellans, HNHoffman, DJSpanton, SGPyter, RACohen, JEgan, DA Azido glycols: potent, low molecular weight renin inhibitors containing an unusual post scissile site residue. J Med Chem 32:1371-8 (1989)  
Target
Name:
Renin
Synonyms:
Angiotensinogenase RENI_HUMAN
Type:
Enzyme
Mol. Mass.:
45058.99
Organism:
Homo sapiens (Human)
Description:
Residue:
406
  
Inhibitor
Name:
BDBM50017773
Synonyms:
CHEMBL280503 | Morpholine-4-carboxylic acid [1-[1-(4-azido-1-cyclohexylmethyl-2,3-dihydroxy-butylcarbamoyl)-2-(3H-imidazol-4-yl)-ethylcarbamoyl]-2-(4-methoxy-phenyl)-ethyl]-amide
Type:
Small organic molecule
Emp. Form.:
C32H47N9O7
Mol. Mass.:
669.7717
SMILES:
COc1ccc(C[C@H](NC(=O)N2CCOCC2)C(=O)N[C@@H](Cc2cnc[nH]2)C(=O)N[C@H](CC2CCCCC2)[C@H](O)[C@H](O)CN=[N+]=[N-])cc1
: