Target
Renin
Ligand
BDBM50017780
Substrate
Meas. Tech.
ChEMBL_195942 (CHEMBL801668)
pH
7.4±n/a
IC50
9±n/a nM
Comments
extracted
Citation
 Rosenberg, SHWoods, KWKleinert, HDStein, HNellans, HNHoffman, DJSpanton, SGPyter, RACohen, JEgan, DA Azido glycols: potent, low molecular weight renin inhibitors containing an unusual post scissile site residue. J Med Chem 32:1371-8 (1989)  
Target
Name:
Renin
Synonyms:
Angiotensinogenase RENI_HUMAN
Type:
Enzyme
Mol. Mass.:
45058.99
Organism:
Homo sapiens (Human)
Description:
Residue:
406
  
Inhibitor
Name:
BDBM50017780
Synonyms:
CHEMBL284451 | {1-[1-(4-Azido-1-cyclohexylmethyl-2,3-dihydroxy-butylcarbamoyl)-2-(3H-imidazol-4-yl)-ethylcarbamoyl]-2-phenyl-ethyl}-carbamic acid tert-butyl ester
Type:
Small organic molecule
Emp. Form.:
C31H46N8O6
Mol. Mass.:
626.7469
SMILES:
CC(C)(C)OC(=O)N[C@@H](Cc1ccccc1)C(=O)N[C@@H](Cc1cnc[nH]1)C(=O)N[C@H](CC1CCCCC1)[C@H](O)[C@H](O)CN=[N+]=[N-]
: