Target
Angiotensin-converting enzyme
Ligand
BDBM50011361
Substrate
Meas. Tech.
ChEBML_34788
IC50
1.9±n/a nM
Citation
 Pascard, CGuilhem, JVincent, MRémond, GPortevin, BLaubie, M Configuration and preferential solid-state conformations of perindoprilat (S-9780). Comparison with the crystal structures of other ACE inhibitors and conclusions related to structure-activity relationships. J Med Chem 34:663-9 (1991)  
Target
Name:
Angiotensin-converting enzyme
Synonyms:
3.2.1.- ACE Angiotensin-converting enzyme, soluble form DCP1 Kininase II
Type:
Mol. Mass.:
150405.15
Organism:
Oryctolagus cuniculus
Description:
Residue:
1310
  
Inhibitor
Name:
BDBM50011361
Synonyms:
1-[2-(1-Carboxy-butylamino)-acetyl]-octahydro-indole-2-carboxylic acid | CHEMBL2371228
Type:
Small organic molecule
Emp. Form.:
C16H26N2O5
Mol. Mass.:
326.388
SMILES:
CCC[C@H](NCC(=O)N1C2CCCCC2C[C@H]1C(O)=O)C(O)=O
: