Target
Sterol O-acyltransferase 1
Ligand
BDBM50003806
Substrate
Meas. Tech.
ChEBML_28352
IC50
280±n/a nM
Citation
 Harris, NVSmith, CAshton, MJBridge, AWBush, RCCoffee, ECDron, DIHarper, MFLythgoe, DJNewton, CG Acyl-CoA:cholesterol O-acyl transferase (ACAT) inhibitors. 1. 2-(Alkylthio)-4,5-diphenyl-1H-imidazoles as potent inhibitors of ACAT. J Med Chem 35:4384-92 (1992)  
Target
Name:
Sterol O-acyltransferase 1
Synonyms:
ACAT-1 Acat SOAT1_RAT Sterol O-acyltransferase, Soat
Type:
PROTEIN
Mol. Mass.:
64165.56
Organism:
Rattus norvegicus
Description:
ChEMBL_28796
Residue:
545
  
Inhibitor
Name:
BDBM50003806
Synonyms:
6-(4,5-Diphenyl-1H-imidazol-2-ylsulfanyl)-3,5-dihydroxy-3-methyl-hexanoic acid ethyl ester | CHEMBL136286
Type:
Small organic molecule
Emp. Form.:
C24H28N2O4S
Mol. Mass.:
440.555
SMILES:
CCOC(=O)CC(C)(O)CC(O)CSc1nc(c([nH]1)-c1ccccc1)-c1ccccc1
: