Target
Sterol O-acyltransferase 1
Ligand
BDBM50368460
Substrate
Meas. Tech.
ChEBML_28352
IC50
1000±n/a nM
Citation
 Harris, NVSmith, CAshton, MJBridge, AWBush, RCCoffee, ECDron, DIHarper, MFLythgoe, DJNewton, CG Acyl-CoA:cholesterol O-acyl transferase (ACAT) inhibitors. 1. 2-(Alkylthio)-4,5-diphenyl-1H-imidazoles as potent inhibitors of ACAT. J Med Chem 35:4384-92 (1992)  
Target
Name:
Sterol O-acyltransferase 1
Synonyms:
ACAT-1 Acat SOAT1_RAT Sterol O-acyltransferase, Soat
Type:
PROTEIN
Mol. Mass.:
64165.56
Organism:
Rattus norvegicus
Description:
ChEMBL_28796
Residue:
545
  
Inhibitor
Name:
BDBM50368460
Synonyms:
CHEMBL1794869
Type:
Small organic molecule
Emp. Form.:
C24H20F6N2O3S
Mol. Mass.:
530.483
SMILES:
C[C@@]1(O)C[C@H](CSc2nc(c([nH]2)-c2ccc(cc2)C(F)(F)F)-c2ccc(cc2)C(F)(F)F)OC(=O)C1
: