Target
Aminopeptidase N
Ligand
BDBM50002027
Substrate
Meas. Tech.
ChEBML_35491
IC50
22±n/a nM
Citation
 Fournié-Zaluski, MCCoric, PTurcaud, SBruetschy, LLucas, ENoble, FRoques, BP Potent and systemically active aminopeptidase N inhibitors designed from active-site investigation. J Med Chem 35:1259-66 (1992)  
Target
Name:
Aminopeptidase N
Synonyms:
AMPN_PIG AP-M Alanyl aminopeptidase Aminopeptidase N (APN) Microsomal aminopeptidase pAPN
Type:
Protein
Mol. Mass.:
108810.25
Organism:
Sus scrofa (Pig)
Description:
P15145
Residue:
963
  
Inhibitor
Name:
BDBM50002027
Synonyms:
1-Mercaptomethyl-3-methyl-butyl-ammonium
Type:
Small organic molecule
Emp. Form.:
C6H16NS
Mol. Mass.:
134.262
SMILES:
CC(C)CC([NH3+])CS
: