Target
Leukotriene B4 receptor 1
Ligand
BDBM50042141
Substrate
Meas. Tech.
ChEBML_99839
Ki
1400±n/a nM
Citation
 Kingsbury, WDPendrak, ILeber, JDBoehm, JCMallet, BSarau, HMFoley, JJSchmidt, DBDaines, RA Synthesis of structural analogs of leukotriene B4 and their receptor binding activity. J Med Chem 36:3308-20 (1993)  
Target
Name:
Leukotriene B4 receptor 1
Synonyms:
BLT BLTR Chemoattractant receptor-like 1 GPR16 LTB4-R 1 Leukotriene B4 R1 Leukotriene B4 receptor 1 P2Y purinoceptor 7 | P2Y7
Type:
Enzyme Catalytic Domain
Mol. Mass.:
37582.68
Organism:
Homo sapiens (Human)
Description:
Q15722
Residue:
352
  
Inhibitor
Name:
BDBM50042141
Synonyms:
6-[7-(1-Hydroxy-nonyl)-quinolin-2-yl]-hex-5-enoic acid | CHEMBL441647
Type:
Small organic molecule
Emp. Form.:
C24H33NO3
Mol. Mass.:
383.5237
SMILES:
CCCCCCCCC(O)c1ccc2ccc(\C=C\CCCC(O)=O)nc2c1
: