Target
Purine nucleoside phosphorylase
Ligand
BDBM50033666
Substrate
Meas. Tech.
ChEMBL_162205 (CHEMBL767214)
Ki
8.7±n/a nM
Citation
 Erion, MDNiwas, SRose, JDAnanthan, SAllen, MSecrist, JABabu, YSBugg, CEGuida, WCEalick, SE Structure-based design of inhibitors of purine nucleoside phosphorylase. 3. 9-Arylmethyl derivatives of 9-deazaguanine substituted on the methylene group. J Med Chem 36:3771-83 (1994)  
Target
Name:
Purine nucleoside phosphorylase
Synonyms:
Inosine phosphorylase NP PNPH_HUMAN | Purine nucleoside phosphorylase (PNPase)
Type:
Enzyme
Mol. Mass.:
32119.53
Organism:
Homo sapiens (Human)
Description:
Residue:
289
  
Inhibitor
Name:
BDBM50033666
Synonyms:
2-[(2-amino-6-oxo-1,6-dihydro-9H-purin-9-yl)methoxy]ethyl trihydrogen diphosphate(ACVDP) CHEMBL7193 | {[2-(2-Amino-6-oxo-1,6-dihydro-purin-9-ylmethoxy)-ethoxy]-hydroxy-diphosphate
Type:
Small organic molecule
Emp. Form.:
C8H13N5O9P2
Mol. Mass.:
385.1644
SMILES:
Nc1nc2n(COCCOP(O)(=O)OP(O)(O)=O)cnc2c(=O)[nH]1
: