Target
Endothelin-converting enzyme 1
Ligand
BDBM50046842
Substrate
Meas. Tech.
ChEMBL_64347 (CHEMBL676078)
IC50
13±n/a nM
Citation
 Shiosaki, KTasker, ASSullivan, GMSorensen, BKvon Geldern, TWWu-Wong, JRMarselle, CAOpgenorth, TJ Potent and selective inhibitors of an aspartyl protease-like endothelin converting enzyme identified in rat lung. J Med Chem 36:468-78 (1993)  
Target
Name:
Endothelin-converting enzyme 1
Synonyms:
ECE1_RAT Ece1 Endothelin-converting enzyme 1 (ECE)
Type:
Protein
Mol. Mass.:
86126.89
Organism:
Rattus norvegicus (Rat)
Description:
P42893
Residue:
762
  
Inhibitor
Name:
BDBM50046842
Synonyms:
3-{4-[2-(2-tert-Butoxycarbonylamino-3-methyl-pentanoylamino)-3-methyl-pentanoylamino]-3-hydroxy-6-methyl-heptanoylamino}-propionic acid ethyl ester | CHEMBL141544
Type:
Small organic molecule
Emp. Form.:
C30H56N4O8
Mol. Mass.:
600.7876
SMILES:
CCOC(=O)CCNC(=O)CC(O)[C@H](CC(C)C)NC(=O)[C@@H](NC(=O)[C@@H](NC(=O)OC(C)(C)C)C(C)CC)C(C)CC
: