Target
Endothelin-converting enzyme 1
Ligand
BDBM50046820
Substrate
Meas. Tech.
ChEMBL_64347 (CHEMBL676078)
IC50
6±n/a nM
Citation
 Shiosaki, KTasker, ASSullivan, GMSorensen, BKvon Geldern, TWWu-Wong, JRMarselle, CAOpgenorth, TJ Potent and selective inhibitors of an aspartyl protease-like endothelin converting enzyme identified in rat lung. J Med Chem 36:468-78 (1993)  
Target
Name:
Endothelin-converting enzyme 1
Synonyms:
ECE1_RAT Ece1 Endothelin-converting enzyme 1 (ECE)
Type:
Protein
Mol. Mass.:
86126.89
Organism:
Rattus norvegicus (Rat)
Description:
P42893
Residue:
762
  
Inhibitor
Name:
BDBM50046820
Synonyms:
4-Methyl-piperazine-1-carboxylic acid {2-cyclohexyl-1-[1-(2,3-dihydroxy-5-methyl-1-naphthalen-2-ylmethyl-hexylcarbamoyl)-2-methyl-butylcarbamoyl]-ethyl}-amide | CHEMBL357865
Type:
Small organic molecule
Emp. Form.:
C39H61N5O5
Mol. Mass.:
679.9321
SMILES:
CCC(C)[C@H](NC(=O)[C@H](CC1CCCCC1)NC(=O)N1CCN(C)CC1)C(=O)N[C@@H](Cc1ccc2ccccc2c1)[C@@H](O)[C@@H](O)CC(C)C
: