Target
Endothelin-converting enzyme 1
Ligand
BDBM50407076
Substrate
Meas. Tech.
ChEMBL_64347 (CHEMBL676078)
IC50
5.7±n/a nM
Citation
 Shiosaki, KTasker, ASSullivan, GMSorensen, BKvon Geldern, TWWu-Wong, JRMarselle, CAOpgenorth, TJ Potent and selective inhibitors of an aspartyl protease-like endothelin converting enzyme identified in rat lung. J Med Chem 36:468-78 (1993)  
Target
Name:
Endothelin-converting enzyme 1
Synonyms:
ECE1_RAT Ece1 Endothelin-converting enzyme 1 (ECE)
Type:
Protein
Mol. Mass.:
86126.89
Organism:
Rattus norvegicus (Rat)
Description:
P42893
Residue:
762
  
Inhibitor
Name:
BDBM50407076
Synonyms:
CHEMBL2112270
Type:
Small organic molecule
Emp. Form.:
C32H60N4O6
Mol. Mass.:
596.842
SMILES:
CC[C@H](C)[C@H](NC(=O)[C@H](CC1CCCCC1)NC(=O)OC(C)(C)C)C(=O)N[C@@H](CC(C)C)[C@@H](O)CC(=O)NCC(C)C
: