Target
Endothelin-converting enzyme 1
Ligand
BDBM50407083
Substrate
Meas. Tech.
ChEMBL_64347 (CHEMBL676078)
IC50
17±n/a nM
Citation
 Shiosaki, KTasker, ASSullivan, GMSorensen, BKvon Geldern, TWWu-Wong, JRMarselle, CAOpgenorth, TJ Potent and selective inhibitors of an aspartyl protease-like endothelin converting enzyme identified in rat lung. J Med Chem 36:468-78 (1993)  
Target
Name:
Endothelin-converting enzyme 1
Synonyms:
ECE1_RAT Ece1 Endothelin-converting enzyme 1 (ECE)
Type:
Protein
Mol. Mass.:
86126.89
Organism:
Rattus norvegicus (Rat)
Description:
P42893
Residue:
762
  
Inhibitor
Name:
BDBM50407083
Synonyms:
CHEMBL2112251
Type:
Small organic molecule
Emp. Form.:
C37H69N7O10
Mol. Mass.:
771.9847
SMILES:
CC[C@H](C)[C@H](NC(=O)OC(C)(C)C)C(=O)N[C@@H]([C@@H](C)CC)C(=O)N[C@@H](CC(C)C)C(O)CC(=O)N[C@@H](C(C)C)C(=O)NC(CC(N)=O)C(=O)NC[C@@H](C)O
: