Target
Endothelin-converting enzyme 1
Ligand
BDBM50407086
Substrate
Meas. Tech.
ChEMBL_64347 (CHEMBL676078)
IC50
12±n/a nM
Citation
 Shiosaki, KTasker, ASSullivan, GMSorensen, BKvon Geldern, TWWu-Wong, JRMarselle, CAOpgenorth, TJ Potent and selective inhibitors of an aspartyl protease-like endothelin converting enzyme identified in rat lung. J Med Chem 36:468-78 (1993)  
Target
Name:
Endothelin-converting enzyme 1
Synonyms:
ECE1_RAT Ece1 Endothelin-converting enzyme 1 (ECE)
Type:
Protein
Mol. Mass.:
86126.89
Organism:
Rattus norvegicus (Rat)
Description:
P42893
Residue:
762
  
Inhibitor
Name:
BDBM50407086
Synonyms:
CHEMBL2112265
Type:
Small organic molecule
Emp. Form.:
C27H51N3O7
Mol. Mass.:
529.7097
SMILES:
CCOC(=O)C[C@H](O)[C@H](CC(C)C)NC(=O)[C@@H](NC(=O)[C@@H](NC(=O)OC(C)(C)C)[C@H](C)CC)[C@@H](C)CC
: