Target
Endothelin-converting enzyme 1
Ligand
BDBM50407090
Substrate
Meas. Tech.
ChEMBL_64347 (CHEMBL676078)
IC50
16±n/a nM
Citation
 Shiosaki, KTasker, ASSullivan, GMSorensen, BKvon Geldern, TWWu-Wong, JRMarselle, CAOpgenorth, TJ Potent and selective inhibitors of an aspartyl protease-like endothelin converting enzyme identified in rat lung. J Med Chem 36:468-78 (1993)  
Target
Name:
Endothelin-converting enzyme 1
Synonyms:
ECE1_RAT Ece1 Endothelin-converting enzyme 1 (ECE)
Type:
Protein
Mol. Mass.:
86126.89
Organism:
Rattus norvegicus (Rat)
Description:
P42893
Residue:
762
  
Inhibitor
Name:
BDBM50407090
Synonyms:
CHEMBL2112837
Type:
Small organic molecule
Emp. Form.:
C28H53N3O7
Mol. Mass.:
543.7363
SMILES:
CCOC(=O)CC(O)[C@H](CC(C)C)NC(=O)[C@@H](NC(=O)[C@H](CC(C)(C)C)NC(=O)OC(C)(C)C)[C@@H](C)CC
: