Target
Angiotensin-converting enzyme
Ligand
BDBM50021153
Substrate
Meas. Tech.
ChEMBL_34911 (CHEMBL648447)
IC50
2±n/a nM
Citation
 Ksander, GMErion, MYuan, AMDiefenbacher, CGel-Chehabi, LCote, DLevens, N Dual angiotensin converting enzyme/thromboxane synthase inhibitors. J Med Chem 37:1823-32 (1994)  
Target
Name:
Angiotensin-converting enzyme
Synonyms:
3.2.1.- ACE Angiotensin-converting enzyme, soluble form DCP1 Kininase II
Type:
Mol. Mass.:
150405.15
Organism:
Oryctolagus cuniculus
Description:
Residue:
1310
  
Inhibitor
Name:
BDBM50021153
Synonyms:
1H-1-Benzazepine-1-acetic acid, 3-((1-(ethoxycarbonyl)-3-phenylpropyl)amino)-2,3,4,5-tetrahydro-2-oxo-, (S-(R*,R*))- CHEMBL838 | [(3S)-3-{[(1S)-1-(ethoxycarbonyl)-3-phenylpropyl]amino}-2-oxo-2,3,4,5-tetrahydro-1H-1-benzazepin-1-yl]acetic acid
Type:
Small organic molecule
Emp. Form.:
C24H28N2O5
Mol. Mass.:
424.4895
SMILES:
CCOC(=O)[C@H](CCc1ccccc1)N[C@H]1CCc2ccccc2N(CC(O)=O)C1=O
: