Target
Alpha-1A adrenergic receptor
Ligand
BDBM50034683
Substrate
Meas. Tech.
ChEMBL_33603 (CHEMBL652811)
Ki
0.16±n/a nM
Citation
 Wetzel, JMMiao, SWForray, CBorden, LABranchek, TAGluchowski, C Discovery of alpha 1a-adrenergic receptor antagonists based on the L-type Ca2+ channel antagonist niguldipine. J Med Chem 38:1579-81 (1995)  
Target
Name:
Alpha-1A adrenergic receptor
Synonyms:
ADA1A_HUMAN ADRA1C Alpha 1A-adrenoceptor Alpha adrenergic receptor 1a Alpha-adrenergic receptor 1c adrenergic Alpha1 | adrenergic Alpha1C
Type:
Cell-surface receptors
Mol. Mass.:
51511.67
Organism:
Homo sapiens (Human)
Description:
P35348
Residue:
466
  
Inhibitor
Name:
BDBM50034683
Synonyms:
(S)-2,6-Dimethyl-4-(3-nitro-phenyl)-1,4-dihydro-pyridine-3,5-dicarboxylic acid 3-[3-(4,4-diphenyl-piperidin-1-yl)-propyl] ester 5-methyl ester | CHEMBL41929
Type:
Small organic molecule
Emp. Form.:
C36H39N3O6
Mol. Mass.:
609.7114
SMILES:
COC(=[OH+])C1=C(C)N=C(C)C([C@H]1c1cccc(c1)[N+]([O-])=O)=C([O-])OCCCN1CCC(CC1)(c1ccccc1)c1ccccc1
: