Target
Muscarinic acetylcholine receptor M1
Ligand
BDBM50031098
Substrate
Meas. Tech.
ChEMBL_138932 (CHEMBL746581)
Kd
6.8±n/a nM
Citation
 McPherson, DWLambert, CRJahn, KSood, VMcRee, RCZeeberg, BReba, RCKnapp, FF Resolution and in vitro and initial in vivo evaluation of isomers of iodine-125-labeled 1-azabicyclo[2.2.2]oct-3-yl alpha-hydroxy-alpha-(1-iodo-1-propen-3-yl)-alpha-phenylacetate: a high-affinity ligand for the muscarinic receptor. J Med Chem 38:3908-17 (1995)  
Target
Name:
Muscarinic acetylcholine receptor M1
Synonyms:
ACM1_RAT Chrm-1 cholinergic receptor, muscarinic 1
Type:
Enzyme Catalytic Domain
Mol. Mass.:
51390.46
Organism:
RAT
Description:
P08482
Residue:
460
  
Inhibitor
Name:
BDBM50031098
Synonyms:
(E)-(R)-2-Hydroxy-5-iodo-2-phenyl-pent-4-enoic acid (R)-(1-aza-bicyclo[2.2.2]oct-3-yl) ester | CHEMBL127587
Type:
Small organic molecule
Emp. Form.:
C18H22INO3
Mol. Mass.:
427.2767
SMILES:
O[C@@](C\C=C\I)(C(=O)O[C@H]1CN2CCC1CC2)c1ccccc1
: