Target
D(2) dopamine receptor
Ligand
BDBM50048235
Substrate
Meas. Tech.
ChEMBL_59154 (CHEMBL671035)
Ki
21±n/a nM
Citation
 Thurkauf, AYuan, JChen, XWasley, JWMeade, RWoodruff, KHHuston, KRoss, PC 1-Phenyl-3-(aminomethyl)pyrroles as potential antipsychotic agents. Synthesis and dopamine receptor binding. J Med Chem 38:4950-2 (1996)  
Target
Name:
D(2) dopamine receptor
Synonyms:
DRD2 Dopamine D2 receptor
Type:
PROTEIN
Mol. Mass.:
50619.11
Organism:
Cercopithecus aethiops
Description:
ChEMBL_59156
Residue:
443
  
Inhibitor
Name:
BDBM50048235
Synonyms:
4-Phenyl-1-(1-phenyl-1H-pyrrol-3-ylmethyl)-piperidine | CHEMBL144835
Type:
Small organic molecule
Emp. Form.:
C22H24N2
Mol. Mass.:
316.4394
SMILES:
C(N1CCC(CC1)c1ccccc1)c1ccn(c1)-c1ccccc1
: