Target
D(2) dopamine receptor
Ligand
BDBM50048233
Substrate
Meas. Tech.
ChEMBL_59154 (CHEMBL671035)
Ki
0.700000±n/a nM
Citation
 Thurkauf, AYuan, JChen, XWasley, JWMeade, RWoodruff, KHHuston, KRoss, PC 1-Phenyl-3-(aminomethyl)pyrroles as potential antipsychotic agents. Synthesis and dopamine receptor binding. J Med Chem 38:4950-2 (1996)  
Target
Name:
D(2) dopamine receptor
Synonyms:
DRD2 Dopamine D2 receptor
Type:
PROTEIN
Mol. Mass.:
50619.11
Organism:
Cercopithecus aethiops
Description:
ChEMBL_59156
Residue:
443
  
Inhibitor
Name:
BDBM50048233
Synonyms:
1-(2-Methoxy-phenyl)-4-(1-phenyl-1H-pyrrol-3-ylmethyl)-piperazine | CHEMBL28321
Type:
Small organic molecule
Emp. Form.:
C22H25N3O
Mol. Mass.:
347.4534
SMILES:
COc1ccccc1N1CCN(Cc2ccn(c2)-c2ccccc2)CC1
: