Target
D(4) dopamine receptor
Ligand
BDBM50048233
Substrate
Meas. Tech.
ChEMBL_60685 (CHEMBL675851)
Ki
1.3±n/a nM
Citation
 Thurkauf, AYuan, JChen, XWasley, JWMeade, RWoodruff, KHHuston, KRoss, PC 1-Phenyl-3-(aminomethyl)pyrroles as potential antipsychotic agents. Synthesis and dopamine receptor binding. J Med Chem 38:4950-2 (1996)  
Target
Name:
D(4) dopamine receptor
Synonyms:
D(2C) dopamine receptor DOPAMINE D4.2 DRD4 Dopamine D4 receptor
Type:
Enzyme
Mol. Mass.:
48373.19
Organism:
Homo sapiens (Human)
Description:
P21917
Residue:
419
  
Inhibitor
Name:
BDBM50048233
Synonyms:
1-(2-Methoxy-phenyl)-4-(1-phenyl-1H-pyrrol-3-ylmethyl)-piperazine | CHEMBL28321
Type:
Small organic molecule
Emp. Form.:
C22H25N3O
Mol. Mass.:
347.4534
SMILES:
COc1ccccc1N1CCN(Cc2ccn(c2)-c2ccccc2)CC1
: