Target
Acetylcholinesterase
Ligand
BDBM50029941
Substrate
Meas. Tech.
ChEMBL_27802 (CHEMBL636512)
Ki
19±n/a nM
Citation
 Inoue, AKawai, TWakita, MIimura, YSugimoto, HKawakami, Y The simulated binding of (+/-)-2,3-dihydro-5,6-dimethoxy-2-[[1-(phenylmethyl)-4-piperidinyl]meth yl] -1H-inden-1-one hydrochloride (E2020) and related inhibitors to free and acylated acetylcholinesterases and corresponding structure-activity analyses. J Med Chem 39:4460-70 (1996)  
Target
Name:
Acetylcholinesterase
Synonyms:
3.1.1.7 Acetylcholinesterase (AChE) ache
Type:
Mol. Mass.:
65900.74
Organism:
Tetronarce californica (Pacific electric ray) (Torpedo californica)
Description:
P04058
Residue:
586
  
Inhibitor
Name:
BDBM50029941
Synonyms:
2-[2-(1-Benzyl-piperidin-4-yl)-ethyl]-5,6-dimethoxy-indan-1-one; hydrochloride CHEMBL545317
Type:
Small organic molecule
Emp. Form.:
C25H31NO3
Mol. Mass.:
393.5185
SMILES:
COc1cc2CC(CCC3CCN(Cc4ccccc4)CC3)C(=O)c2cc1OC
: