Target
Acetylcholinesterase
Ligand
BDBM50422179
Substrate
Meas. Tech.
ChEMBL_27803 (CHEMBL636513)
Ki
37.6±n/a nM
Citation
 Inoue, AKawai, TWakita, MIimura, YSugimoto, HKawakami, Y The simulated binding of (+/-)-2,3-dihydro-5,6-dimethoxy-2-[[1-(phenylmethyl)-4-piperidinyl]meth yl] -1H-inden-1-one hydrochloride (E2020) and related inhibitors to free and acylated acetylcholinesterases and corresponding structure-activity analyses. J Med Chem 39:4460-70 (1996)  
Target
Name:
Acetylcholinesterase
Synonyms:
3.1.1.7 Acetylcholinesterase (AChE) ache
Type:
Mol. Mass.:
65900.74
Organism:
Tetronarce californica (Pacific electric ray) (Torpedo californica)
Description:
P04058
Residue:
586
  
Inhibitor
Name:
BDBM50422179
Synonyms:
CHEMBL2093912
Type:
Small organic molecule
Emp. Form.:
C24H29NO3
Mol. Mass.:
379.492
SMILES:
COc1cc2C[C@H](CC3CCN(Cc4ccccc4)CC3)C(=O)c2cc1OC
: