Target
Sodium/potassium-transporting ATPase subunit alpha-1
Ligand
BDBM50408277
Substrate
Meas. Tech.
ChEMBL_144092 (CHEMBL857543)
IC50
7940±n/a nM
Citation
 Cerri, ASerra, FFerrari, PFolpini, EPadoani, GMelloni, P Synthesis, cardiotonic activity, and structure-activity relationships of 17 beta-guanylhydrazone derivatives of 5 beta-androstane-3 beta, 14 beta-diol acting on the Na+,K(+)-ATPase receptor. J Med Chem 40:3484-8 (1997)  
Target
Name:
Sodium/potassium-transporting ATPase subunit alpha-1
Synonyms:
AT1A1_CANLF Sodium/potassium-transporting ATPase alpha-1 chain
Type:
PROTEIN
Mol. Mass.:
112656.60
Organism:
Canis familiaris
Description:
ChEMBL_144092
Residue:
1021
  
Inhibitor
Name:
BDBM50408277
Synonyms:
CHEMBL2068936
Type:
Small organic molecule
Emp. Form.:
C25H40N4O2
Mol. Mass.:
428.6107
SMILES:
[#6][C@]12[#6]-[#6]-[#6@H]3-[#6@@H](-[#6]-[#6]-[#6@@H]4-[#6]-[#6@@H](-[#8])-[#6]-[#6][C@]34[#6])[C@@]1([#8])[#6]-[#6]-[#6@@H]2-[#6]=[#6]-[#6]=[#6]-[#6]=[#7]\[#7]=[#6](\[#7])-[#7]
: