Target
Sodium/potassium-transporting ATPase subunit alpha-1
Ligand
BDBM50408279
Substrate
Meas. Tech.
ChEMBL_144092 (CHEMBL857543)
IC50
3980±n/a nM
Citation
 Cerri, ASerra, FFerrari, PFolpini, EPadoani, GMelloni, P Synthesis, cardiotonic activity, and structure-activity relationships of 17 beta-guanylhydrazone derivatives of 5 beta-androstane-3 beta, 14 beta-diol acting on the Na+,K(+)-ATPase receptor. J Med Chem 40:3484-8 (1997)  
Target
Name:
Sodium/potassium-transporting ATPase subunit alpha-1
Synonyms:
AT1A1_CANLF Sodium/potassium-transporting ATPase alpha-1 chain
Type:
PROTEIN
Mol. Mass.:
112656.60
Organism:
Canis familiaris
Description:
ChEMBL_144092
Residue:
1021
  
Inhibitor
Name:
BDBM50408279
Synonyms:
CHEMBL2069128
Type:
Small organic molecule
Emp. Form.:
C25H36O4
Mol. Mass.:
400.5509
SMILES:
C[C@]12CC[C@H]3[C@@H](CC[C@@H]4C[C@@H](O)CC[C@]34C)[C@@]1(O)CC[C@@H]2\C=C\C1=CC(=O)OC1
: