Target
Serine protease 1
Ligand
BDBM50060709
Substrate
Meas. Tech.
ChEMBL_212860 (CHEMBL817812)
Ki
5000±n/a nM
Citation
 Tucker, TJLumma, WCLewis, SDGardell, SJLucas, BJSisko, JTLynch, JJLyle, EABaskin, EPWoltmann, RFAppleby, SDChen, IWDancheck, KBNaylor-Olsen, AMKrueger, JACooper, CMVacca, JP Synthesis of a series of potent and orally bioavailable thrombin inhibitors that utilize 3,3-disubstituted propionic acid derivatives in the P3 position. J Med Chem 40:3687-93 (1997)  
Target
Name:
Serine protease 1
Synonyms:
Alpha-trypsin chain 1 Beta-trypsin PRSS1 TRP1 TRY1_HUMAN Thrombin & trypsin Trypsin I | Trypsin-1
Type:
Enzyme
Mol. Mass.:
26557.80
Organism:
Homo sapiens (Human)
Description:
P07477
Residue:
247
  
Inhibitor
Name:
BDBM50060709
Synonyms:
(S)-1-(3-Phenyl-3-pyridin-2-yl-propionyl)-pyrrolidine-2-carboxylic acid (4-amino-cyclohexylmethyl)-amide; TFA | CHEMBL332870
Type:
Small organic molecule
Emp. Form.:
C26H34N4O2
Mol. Mass.:
434.5738
SMILES:
NC1CCC(CNC(=O)[C@@H]2CCCN2C(=O)CC(c2ccccc2)c2ccccn2)CC1
: