Target
Tissue-type plasminogen activator
Ligand
BDBM50060704
Substrate
Meas. Tech.
ChEMBL_208240 (CHEMBL872720)
Ki
268000±n/a nM
Citation
 Tucker, TJLumma, WCLewis, SDGardell, SJLucas, BJSisko, JTLynch, JJLyle, EABaskin, EPWoltmann, RFAppleby, SDChen, IWDancheck, KBNaylor-Olsen, AMKrueger, JACooper, CMVacca, JP Synthesis of a series of potent and orally bioavailable thrombin inhibitors that utilize 3,3-disubstituted propionic acid derivatives in the P3 position. J Med Chem 40:3687-93 (1997)  
Target
Name:
Tissue-type plasminogen activator
Synonyms:
Alteplase Reteplase Thrombin receptor protein Tissue-type plasminogen activator (tPA) t-PA t-plasminogen activator
Type:
Enzyme
Mol. Mass.:
62931.08
Organism:
Homo sapiens (Human)
Description:
Residue:
562
  
Inhibitor
Name:
BDBM50060704
Synonyms:
(S)-1-(2-5H-Dibenzo[a,d]cyclohepten-5-yl-acetyl)-pyrrolidine-2-carboxylic acid (4-amino-cyclohexylmethyl)-amide; hydrochloride | CHEMBL555753
Type:
Small organic molecule
Emp. Form.:
C29H35N3O2
Mol. Mass.:
457.6071
SMILES:
NC1CCC(CNC(=O)[C@@H]2CCCN2C(=O)CC2c3ccccc3C=Cc3ccccc23)CC1
: