Target
Tissue-type plasminogen activator
Ligand
BDBM50060708
Substrate
Meas. Tech.
ChEMBL_208240 (CHEMBL872720)
Ki
>500000±n/a nM
Citation
 Tucker, TJLumma, WCLewis, SDGardell, SJLucas, BJSisko, JTLynch, JJLyle, EABaskin, EPWoltmann, RFAppleby, SDChen, IWDancheck, KBNaylor-Olsen, AMKrueger, JACooper, CMVacca, JP Synthesis of a series of potent and orally bioavailable thrombin inhibitors that utilize 3,3-disubstituted propionic acid derivatives in the P3 position. J Med Chem 40:3687-93 (1997)  
Target
Name:
Tissue-type plasminogen activator
Synonyms:
Alteplase Reteplase Thrombin receptor protein Tissue-type plasminogen activator (tPA) t-PA t-plasminogen activator
Type:
Enzyme
Mol. Mass.:
62931.08
Organism:
Homo sapiens (Human)
Description:
Residue:
562
  
Inhibitor
Name:
BDBM50060708
Synonyms:
(S)-1-(3-Benzo[1,3]dioxol-5-yl-3-pyridin-3-yl-propionyl)-pyrrolidine-2-carboxylic acid (4-amino-cyclohexylmethyl)-amide; TFA | CHEMBL330791
Type:
Small organic molecule
Emp. Form.:
C27H34N4O4
Mol. Mass.:
478.5833
SMILES:
NC1CCC(CNC(=O)[C@@H]2CCCN2C(=O)CC(c2cccnc2)c2ccc3OCOc3c2)CC1
: