Target
Delta-type opioid receptor
Ligand
BDBM50061291
Substrate
Meas. Tech.
ChEMBL_145898 (CHEMBL750387)
IC50
0.18±n/a nM
Citation
 Hruby, VJBartosz-Bechowski, HDavis, PSlaninova, JZalewska, TStropova, DPorreca, FYamamura, HI Cyclic enkephalin analogues with exceptional potency and selectivity for delta-opioid receptors. J Med Chem 40:3957-62 (1998)  
Target
Name:
Delta-type opioid receptor
Synonyms:
DOR-1 MSL-2 OPRD_MOUSE Oprd1
Type:
Enzyme Catalytic Domain
Mol. Mass.:
40577.25
Organism:
MOUSE
Description:
P32300
Residue:
372
  
Inhibitor
Name:
BDBM50061291
Synonyms:
(S)-2-{[(4R,7S,13S)-13-[(S)-2-Amino-3-(4-hydroxy-phenyl)-propionylamino]-7-(4-bromo-benzyl)-3,3,14,14-tetramethyl-6,9,12-trioxo-1,2-dithia-5,8,11-triaza-cyclotetradecane-4-carbonyl]-amino}-3-phenyl-propionic acid | CHEMBL340176
Type:
Small organic molecule
Emp. Form.:
C39H47BrN6O8S2
Mol. Mass.:
871.86
SMILES:
CC1(C)SSC(C)(C)[C@@H](NC(=O)[C@@H](N)Cc2ccc(O)cc2)C(=O)NCC(=O)N[C@@H](Cc2ccc(Br)cc2)C(=O)N[C@@H]1C(=O)N[C@@H](Cc1ccccc1)C(O)=O
: