Target
D(2) dopamine receptor
Ligand
BDBM86053
Substrate
Meas. Tech.
ChEMBL_62885 (CHEMBL673595)
Ki
2700±n/a nM
Citation
 Mewshaw, REKavanagh, JStack, GMarquis, KLShi, XKagan, MZWebb, MBKatz, AHPark, AKang, YHAbou-Gharbia, MScerni, RWasik, TCortes-Burgos, LSpangler, TBrennan, JAPiesla, MMazandarani, HCockett, MIOchalski, RCoupet, JAndree, TH New generation dopaminergic agents. 1. Discovery of a novel scaffold which embraces the D2 agonist pharmacophore. Structure-activity relationships of a series of 2-(aminomethyl)chromans. J Med Chem 40:4235-56 (1998)  
Target
Name:
D(2) dopamine receptor
Synonyms:
DOPAMINE D2 DOPAMINE D2 Short Dopamine D2 receptor Drd2
Type:
G Protein-Coupled Receptor (GPCR)
Mol. Mass.:
50931.60
Organism:
Rattus norvegicus (rat)
Description:
P61169
Residue:
444
  
Inhibitor
Name:
BDBM86053
Synonyms:
B-HT 920 CHEMBL279085 Talipexole | cid_5374
Type:
Small organic molecule
Emp. Form.:
C10H15N3S
Mol. Mass.:
209.311
SMILES:
Nc1nc2CCN(CC=C)CCc2s1
: