Target
Gastrin/cholecystokinin type B receptor
Ligand
BDBM50056449
Substrate
Meas. Tech.
ChEMBL_48095 (CHEMBL663082)
Ki
18.0±n/a nM
Citation
 Blommaert, AGDhôtel, HDucos, BDurieux, CGoudreau, NBado, AGarbay, CRoques, BP Structure-based design of new constrained cyclic agonists of the cholecystokinin CCK-B receptor. J Med Chem 40:647-58 (1997)  
Target
Name:
Gastrin/cholecystokinin type B receptor
Synonyms:
CCK-2 receptor CCK-BR CCKRB Cholecystokinin receptor GASR_HUMAN | Gastrin/cholecystokinin type B receptor
Type:
G Protein-Coupled Receptor (GPCR)
Mol. Mass.:
48445.79
Organism:
Homo sapiens (Human)
Description:
Stable expression of human CCK-2 receptors in HEK 293 cells.
Residue:
447
  
Inhibitor
Name:
BDBM50056449
Synonyms:
CHEMBL2371222 | N-(1-Carbamoyl-2-phenyl-ethyl)-3-{[(2R,5R)-2-(1H-indol-3-ylmethyl)-2-methyl-3,13-dioxo-1,4diaza-cyclotridecane-5-carbonyl]-amino}-succinamic acid
Type:
Small organic molecule
Emp. Form.:
C35H44N6O7
Mol. Mass.:
660.7599
SMILES:
C[C@]1(Cc2c[nH]c3ccccc23)NC(=O)CCCCCCC[C@@H](NC1=O)C(=O)N[C@@H](CC(O)=O)C(=O)N[C@@H](Cc1ccccc1)C(N)=O
: