Target
Gastrin/cholecystokinin type B receptor
Ligand
BDBM50056453
Substrate
Meas. Tech.
ChEMBL_48095 (CHEMBL663082)
Ki
0.80±n/a nM
Citation
 Blommaert, AGDhôtel, HDucos, BDurieux, CGoudreau, NBado, AGarbay, CRoques, BP Structure-based design of new constrained cyclic agonists of the cholecystokinin CCK-B receptor. J Med Chem 40:647-58 (1997)  
Target
Name:
Gastrin/cholecystokinin type B receptor
Synonyms:
CCK-2 receptor CCK-BR CCKRB Cholecystokinin receptor GASR_HUMAN | Gastrin/cholecystokinin type B receptor
Type:
G Protein-Coupled Receptor (GPCR)
Mol. Mass.:
48445.79
Organism:
Homo sapiens (Human)
Description:
Stable expression of human CCK-2 receptors in HEK 293 cells.
Residue:
447
  
Inhibitor
Name:
BDBM50056453
Synonyms:
3-(2-{[2-tert-Butoxycarbonylamino-3-(1H-indol-3-yl)-propionyl]-methyl-amino}-hexanoylamino)-N-(1-carbamoyl-2-phenyl-ethyl)-succinamic acid | CHEMBL160485
Type:
Small organic molecule
Emp. Form.:
C36H48N6O8
Mol. Mass.:
692.8017
SMILES:
CCCCC(N(C)C(=O)C(Cc1c[nH]c2ccccc12)NC(=O)OC(C)(C)C)C(=O)NC(CC(O)=O)C(=O)NC(Cc1ccccc1)C(N)=O
: