Target
Muscarinic acetylcholine receptor M1
Ligand
BDBM50366775
Substrate
Meas. Tech.
ChEMBL_139075 (CHEMBL745670)
Ki
0.59±n/a nM
Citation
 Kline, RHIzenwasser, SKatz, JLJoseph, DBBowen, WDNewman, AH 3'-Chloro-3 alpha-(diphenylmethoxy)tropane but not 4'-chloro-3 alpha-(diphenylmethoxy)tropane produces a cocaine-like behavioral profile. J Med Chem 40:851-7 (1997)  
Target
Name:
Muscarinic acetylcholine receptor M1
Synonyms:
ACM1_RAT Chrm-1 cholinergic receptor, muscarinic 1
Type:
Enzyme Catalytic Domain
Mol. Mass.:
51390.46
Organism:
RAT
Description:
P08482
Residue:
460
  
Inhibitor
Name:
BDBM50366775
Synonyms:
BENZTROPINE | Benzatropine
Type:
Small organic molecule
Emp. Form.:
C21H25NO
Mol. Mass.:
307.4293
SMILES:
CN1[C@H]2CC[C@@H]1C[C@@H](C2)OC(c1ccccc1)c1ccccc1
: