Target
Histamine H1 receptor
Ligand
BDBM50056946
Substrate
Meas. Tech.
ChEMBL_84717 (CHEMBL695165)
Ki
42±n/a nM
Citation
 el Ahmad, YLaurent, EMaillet, PTalab, ATeste, JFDokhan, RTran, GOllivier, R New benzocycloalkylpiperazines, potent and selective 5-HT1A receptor ligands. J Med Chem 40:952-60 (1997)  
Target
Name:
Histamine H1 receptor
Synonyms:
HISTAMINE H1 Hrh1
Type:
Enzyme Catalytic Domain
Mol. Mass.:
55716.35
Organism:
RAT
Description:
HISTAMINE H1 HRH1 RAT::P31390
Residue:
486
  
Inhibitor
Name:
BDBM50056946
Synonyms:
1-(4-Fluoro-phenyl)-4-[4-(1,2,3,4-tetrahydro-naphthalen-1-yl)-piperazin-1-yl]-butan-1-one | CHEMBL366388
Type:
Small organic molecule
Emp. Form.:
C24H29FN2O
Mol. Mass.:
380.4983
SMILES:
Fc1ccc(cc1)C(=O)CCCN1CCN(CC1)C1CCCc2ccccc12
: