Target
D(2) dopamine receptor
Ligand
BDBM50056946
Substrate
Meas. Tech.
ChEMBL_59490 (CHEMBL670142)
Ki
110±n/a nM
Citation
 el Ahmad, YLaurent, EMaillet, PTalab, ATeste, JFDokhan, RTran, GOllivier, R New benzocycloalkylpiperazines, potent and selective 5-HT1A receptor ligands. J Med Chem 40:952-60 (1997)  
Target
Name:
D(2) dopamine receptor
Synonyms:
DOPAMINE D2 DRD2_BOVIN | Dopamine D2 receptor
Type:
Enzyme Catalytic Domain
Mol. Mass.:
50698.79
Organism:
BOVINE
Description:
P20288
Residue:
444
  
Inhibitor
Name:
BDBM50056946
Synonyms:
1-(4-Fluoro-phenyl)-4-[4-(1,2,3,4-tetrahydro-naphthalen-1-yl)-piperazin-1-yl]-butan-1-one | CHEMBL366388
Type:
Small organic molecule
Emp. Form.:
C24H29FN2O
Mol. Mass.:
380.4983
SMILES:
Fc1ccc(cc1)C(=O)CCCN1CCN(CC1)C1CCCc2ccccc12
: