Target
5-hydroxytryptamine receptor 1A
Ligand
BDBM50056946
Substrate
Meas. Tech.
ChEMBL_571 (CHEMBL615589)
Ki
17±n/a nM
Citation
 el Ahmad, YLaurent, EMaillet, PTalab, ATeste, JFDokhan, RTran, GOllivier, R New benzocycloalkylpiperazines, potent and selective 5-HT1A receptor ligands. J Med Chem 40:952-60 (1997)  
Target
Name:
5-hydroxytryptamine receptor 1A
Synonyms:
5-HT-1A 5-HT1A 5-hydroxytryptamine receptor 1A (5HT1A) 5ht1a Htr1a Serotonin 1a (5-HT1a) receptor/Adrenergic receptor alpha-1 | Serotonin receptor 1A
Type:
G Protein-Coupled Receptor (GPCR)
Mol. Mass.:
46445.29
Organism:
Rattus norvegicus (rat)
Description:
Binding assays were performed using rat hippocampal membranes.
Residue:
422
  
Inhibitor
Name:
BDBM50056946
Synonyms:
1-(4-Fluoro-phenyl)-4-[4-(1,2,3,4-tetrahydro-naphthalen-1-yl)-piperazin-1-yl]-butan-1-one | CHEMBL366388
Type:
Small organic molecule
Emp. Form.:
C24H29FN2O
Mol. Mass.:
380.4983
SMILES:
Fc1ccc(cc1)C(=O)CCCN1CCN(CC1)C1CCCc2ccccc12
: