Target
Sodium-dependent dopamine transporter
Ligand
BDBM50451132
Substrate
Meas. Tech.
ChEMBL_61515 (CHEMBL671435)
IC50
2.6±n/a nM
Citation
 Hoepping, AReisgys, MBrust, PSeifert, SSpies, HAlberto, RJohannsen, B TROTEC-1: a new high-affinity ligand for labeling of the dopamine transporter. J Med Chem 41:4429-32 (1998)  
Target
Name:
Sodium-dependent dopamine transporter
Synonyms:
DA transporter DAT1 Dopamine transporter protein (DAT) SC6A3_HUMAN Sodium-dependent dopamine transporter Solute carrier family 6 member 3
Type:
Multi-pass membrane protein
Mol. Mass.:
68497.11
Organism:
Homo sapiens (Human)
Description:
Q01959
Residue:
620
  
Inhibitor
Name:
BDBM50451132
Synonyms:
CHEMBL2079586 | WIN-35428
Type:
Small organic molecule
Emp. Form.:
C16H20FNO2
Mol. Mass.:
277.3339
SMILES:
[H][C@@]12CC[C@]([H])([C@H]([C@H](C1)c1ccc(F)cc1)C(=O)OC)N2C
: