Target
Sodium-dependent noradrenaline transporter
Ligand
BDBM50451132
Substrate
Meas. Tech.
ChEMBL_142804 (CHEMBL751377)
IC50
834±n/a nM
Citation
 Hoepping, AReisgys, MBrust, PSeifert, SSpies, HAlberto, RJohannsen, B TROTEC-1: a new high-affinity ligand for labeling of the dopamine transporter. J Med Chem 41:4429-32 (1998)  
Target
Name:
Sodium-dependent noradrenaline transporter
Synonyms:
Monoamine transporter NET Noradrenaline Transporter (NET) Norepinephrine transporter protein (NET) SLC6A2 Sodium-dependent noradrenaline transporter (NET) | Solute carrier family 6 member 2
Type:
Multi-pass membrane protein
Mol. Mass.:
69337.72
Organism:
Homo sapiens (Human)
Description:
P23975
Residue:
617
  
Inhibitor
Name:
BDBM50451132
Synonyms:
CHEMBL2079586 | WIN-35428
Type:
Small organic molecule
Emp. Form.:
C16H20FNO2
Mol. Mass.:
277.3339
SMILES:
[H][C@@]12CC[C@]([H])([C@H]([C@H](C1)c1ccc(F)cc1)C(=O)OC)N2C
: