Target
Sodium-dependent noradrenaline transporter
Ligand
BDBM50067771
Substrate
Meas. Tech.
ChEMBL_142804 (CHEMBL751377)
IC50
16±n/a nM
Citation
 Hoepping, AReisgys, MBrust, PSeifert, SSpies, HAlberto, RJohannsen, B TROTEC-1: a new high-affinity ligand for labeling of the dopamine transporter. J Med Chem 41:4429-32 (1998)  
Target
Name:
Sodium-dependent noradrenaline transporter
Synonyms:
Monoamine transporter NET Noradrenaline Transporter (NET) Norepinephrine transporter protein (NET) SLC6A2 Sodium-dependent noradrenaline transporter (NET) | Solute carrier family 6 member 2
Type:
Multi-pass membrane protein
Mol. Mass.:
69337.72
Organism:
Homo sapiens (Human)
Description:
P23975
Residue:
617
  
Inhibitor
Name:
BDBM50067771
Synonyms:
3-(2-Methylsulfanyl-ethylsulfanyl)-propionic acid (2S,3S)-3-(4-fluoro-phenyl)-8-methyl-8-aza-bicyclo[3.2.1]oct-2-ylmethyl ester | CHEMBL422290
Type:
Small organic molecule
Emp. Form.:
C21H30FNO2S2
Mol. Mass.:
411.597
SMILES:
CSCCSCCC(=O)OC[C@@H]1C2CCC(C[C@@H]1c1ccc(F)cc1)N2C
: