Target
Dihydrofolate reductase
Ligand
BDBM50068809
Substrate
Meas. Tech.
ChEMBL_54279 (CHEMBL669872)
Ki
0.000±n/a nM
Citation
 Rosowsky, AWright, JEVaidya, CMBader, HForsch, RAMota, CEPardo, JChen, CSChen, YN Synthesis and potent antifolate activity and cytotoxicity of B-ring deaza analogues of the nonpolyglutamatable dihydrofolate reductase inhibitor Nalpha-(4-amino-4-deoxypteroyl)-Ndelta-hemiphthaloyl- L-ornithine (PT523). J Med Chem 41:5310-9 (1999)  
Target
Name:
Dihydrofolate reductase
Synonyms:
DHFR Dihydrofolate reductase (DHFR) | Tetrahydrofolate dehydrogenase
Type:
Enzyme
Mol. Mass.:
21453.99
Organism:
Homo sapiens (Human)
Description:
Recombinant human DHFR.
Residue:
187
  
Inhibitor
Name:
BDBM50068809
Synonyms:
CHEMBL150607 | N-(4-Carboxy-4-{4-[(2,4-diamino-5-methyl-pyrido[2,3-d]pyrimidin-6-ylmethyl)-amino]-benzoylamino}-butyl)-phthalamic acid
Type:
Small organic molecule
Emp. Form.:
C29H30N8O6
Mol. Mass.:
586.5985
SMILES:
Cc1c(CNc2ccc(cc2)C(=O)NC(CCCNC(=O)c2ccccc2C(O)=O)C(O)=O)cnc2nc(N)nc(N)c12
: