Target
Dihydrofolate reductase
Ligand
BDBM50068808
Substrate
Meas. Tech.
ChEMBL_54279 (CHEMBL669872)
Ki
0.000±n/a nM
Citation
 Rosowsky, AWright, JEVaidya, CMBader, HForsch, RAMota, CEPardo, JChen, CSChen, YN Synthesis and potent antifolate activity and cytotoxicity of B-ring deaza analogues of the nonpolyglutamatable dihydrofolate reductase inhibitor Nalpha-(4-amino-4-deoxypteroyl)-Ndelta-hemiphthaloyl- L-ornithine (PT523). J Med Chem 41:5310-9 (1999)  
Target
Name:
Dihydrofolate reductase
Synonyms:
DHFR Dihydrofolate reductase (DHFR) | Tetrahydrofolate dehydrogenase
Type:
Enzyme
Mol. Mass.:
21453.99
Organism:
Homo sapiens (Human)
Description:
Recombinant human DHFR.
Residue:
187
  
Inhibitor
Name:
BDBM50068808
Synonyms:
CHEMBL297088 N-(4-Carboxy-4-{4-[1-(6,8-diamino-quinoxalin-2-ylmethyl)-but-3-ynyl]-benzoylamino}-butyl)-phthalamic acid
Type:
Small organic molecule
Emp. Form.:
C29H29N7O6
Mol. Mass.:
571.5839
SMILES:
Nc1nc(N)c2cc(CNc3ccc(cc3)C(=O)NC(CCCNC(=O)c3ccccc3C(O)=O)C(O)=O)ccc2n1
: